[Bug 4083] New: Compiler halted during install with wineinstall

Wine Bugs wine-bugs at winehq.org
Thu Dec 15 18:04:23 CST 2005


           Summary: Compiler halted during install with wineinstall
           Product: Wine
           Version: 0.9.3.
          Platform: PC
        OS/Version: Linux
            Status: UNCONFIRMED
          Severity: normal
          Priority: P2
         Component: wine-x11driver
        AssignedTo: wine-bugs at winehq.org
        ReportedBy: rrubr at hotmail.com

make[2]: Entering directory `/home/richard/wine-0.9.3/dlls/ddraw'
../../tools/winegcc/winegcc -B../../tools/winebuild -shared ./ddraw.spec   
clipper.o ddraw_hal.o ddraw_main.o ddraw_thunks.o ddraw_user.o ddraw_utils.o
main.o palette_hal.o palette_main.o regsvr.o surface_dib.o surface_fakezbuffer.o
surface_gamma.o surface_hal.o surface_main.o surface_thunks.o surface_user.o
surface_wndproc.o  version.res   -o ddraw.dll.so -L../../dlls -L../../dlls/ole32
-L../../dlls/user32 -L../../dlls/gdi32 -L../../dlls/advapi32
-L../../dlls/kernel32 -L../../dlls/ntdll -lole32 -luser32 -lgdi32 -ladvapi32
-lkernel32 -lntdll  -L../../libs/wine -lwine -ldxguid -luuid  -L/usr/X11R6/lib 
-lXext -lX11   -L../../libs/port -lwine_port
/usr/bin/ld: cannot find -lXext
collect2: ld returned 1 exit status
winegcc: gcc failed.
make[2]: *** [ddraw.dll.so] Error 2
make[2]: Leaving directory `/home/richard/wine-0.9.3/dlls/ddraw'
make[1]: *** [ddraw] Error 2
make[1]: Leaving directory `/home/richard/wine-0.9.3/dlls'
make: *** [dlls] Error 2

Compilation failed, aborting install.
richard at debbie:~/wine-0.9.3$

Configure bugmail: http://bugs.winehq.org/userprefs.cgi?tab=email
------- You are receiving this mail because: -------
You are the assignee for the bug, or are watching the assignee.

More information about the wine-bugs mailing list