[Bug 3357] 20050919 CVS does not compile.

Wine Bugs wine-bugs at winehq.org
Tue Sep 20 12:48:57 CDT 2005


------- Additional Comments From philip.kent at ntlworld.com  2005-20-09 12:48 -------
Im not getting that error any more. Now I am getting this:

make[2]: Entering directory `/home/compile/wine/dlls/x11drv'
gcc -c -I. -I. -I../../include -I../../include  -D__WINESRC__   -D_REENTRANT
-fPIC -Wall -pipe -mpreferred-stack-boundary=2 -fno-strict-aliasing -gstabs+
-Wdeclaration-after-statement -Wpointer-arith  -g -O2  -o xrender.o xrender.c
xrender.c:1659: error: conflicting types for ‘X11DRV_XRender_ExtTextOut’
x11drv.h:273: error: previous declaration of ‘X11DRV_XRender_ExtTextOut’ was here
make[2]: *** [xrender.o] Error 1

Configure bugmail: http://bugs.winehq.org/userprefs.cgi?tab=email
------- You are receiving this mail because: -------
You are the assignee for the bug, or are watching the assignee.

More information about the wine-bugs mailing list