[Bug 15959] New: make test fails if gecko is not installed

wine-bugs at winehq.org wine-bugs at winehq.org
Sat Nov 8 09:28:21 CST 2008


           Summary: make test fails if gecko is not installed
           Product: Wine
           Version: 1.1.7
          Platform: PC
        OS/Version: Linux
            Status: UNCONFIRMED
          Severity: normal
          Priority: P2
         Component: testcases
        AssignedTo: wine-bugs at winehq.org
        ReportedBy: jeremielapuree at yahoo.fr

With a fresh .wine, I do not have gecko installed. So, make test fails. I think
that in this case, make test should skip the failed tests and should go on.


Could not load Mozilla. HTML rendering will be disabled.
dom.c:3577: Test failed: get_body failed: 8000ffff
dom.c:3583: Tests skipped: Could not get document body. Assuming no Gecko
make[2]: *** [dom.ok] Erreur 8
make[2]: quittant le répertoire « /home/david/wine/dlls/mshtml/tests »
make[1]: *** [mshtml/tests/__test__] Erreur 2
make[1]: quittant le répertoire « /home/david/wine/dlls »
make: *** [dlls/__test__] Erreur 2

Configure bugmail: http://bugs.winehq.org/userprefs.cgi?tab=email
Do not reply to this email, post in Bugzilla using the
above URL to reply.
------- You are receiving this mail because: -------
You are watching all bug changes.

More information about the wine-bugs mailing list