[Bug 21334] New: build broken on OpenSolaris

wine-bugs at winehq.org wine-bugs at winehq.org
Mon Jan 11 18:39:09 CST 2010


           Summary: build broken on OpenSolaris
           Product: Wine
           Version: unspecified
          Platform: x86
        OS/Version: Linux
            Status: NEW
          Keywords: download, regression, source, win16
          Severity: blocker
          Priority: P2
         Component: build-env
        AssignedTo: wine-bugs at winehq.org
        ReportedBy: austinenglish at gmail.com

Haven't tested OpenSolaris in a while. Had someone ask me to help them get a
program running on it, and tested it in 1.1.36. Fails:
gmake[2]: Entering directory
../../tools/winegcc/winegcc  -B../../tools/winebuild --sysroot=../.. -shared
./krnl386.exe16.spec atom.o dma.o dosaspi.o dosconf.o dosdev.o dosexe.o
dosmem.o dosvm.o error.o file.o fpu.o global.o instr.o int09.o int10.o int13.o
int15.o int16.o int21.o int25.o int26.o int2f.o int31.o int33.o int67.o
interrupts.o ioports.o kernel.o local.o ne_module.o ne_segment.o registry.o
relay.o resource.o selector.o snoop.o soundblaster.o syslevel.o task.o thunk.o
timer.o utthunk.o vga.o vxd.o wowthunk.o    version.res  relay16asm.o
-Wb,--subsystem,win16,--dll-name,kernel -o krnl386.exe16.so -lddraw -ldsound
-luser32 -lkernel32 -lntdll -Wb,-dddraw -Wb,-ddsound -Wb,-duser32
../../libs/port/libwine_port.a  -R/opt/bordeaux/lib -L/usr/sfw/lib
-R/usr/sfw/lib -L/usr/X11/lib -R/usr/X11/lib -lsocket -lnsl 
winegcc: ../../tools/winebuild/winebuild failed
gmake[2]: *** [krnl386.exe16.so] Error 2
gmake[2]: Leaving directory
gmake[1]: *** [krnl386.exe16] Error 2
gmake[1]: Leaving directory
gmake: *** [dlls] Error 2

Configure bugmail: http://bugs.winehq.org/userprefs.cgi?tab=email
Do not reply to this email, post in Bugzilla using the
above URL to reply.
------- You are receiving this mail because: -------
You are watching all bug changes.

More information about the wine-bugs mailing list