Houston, we have a problem...

Dimitrie O. Paun dpaun at rogers.com
Thu Dec 12 01:06:04 CST 2002

Configure finished.  Do 'make depend && make' to compile Wine.

cd `dirname dlls/__depend__` && make depend
make[1]: Entering directory `/opt/dimi/dev/wine/wine/dlls'
cd `dirname advapi32/__depend__` && make depend
make[2]: Entering directory `/opt/dimi/dev/wine/wine/dlls/advapi32'
cd `dirname tests/__depend__` && make depend
make[3]: Entering directory `/opt/dimi/dev/wine/wine/dlls/advapi32/tests'
../../../tools/makedep -I../../../../wine.src/dlls/advapi32/tests -I. -I../../../../wine.src/include -I../../../include  -C../../../../wine.src/dlls/advapi32/tests registry.c     testlist.c
../../../../wine.src/dlls/advapi32/tests/testlist.c: No such file or directory
make[3]: *** [depend] Error 1
make[3]: Leaving directory `/opt/dimi/dev/wine/wine/dlls/advapi32/tests'
make[2]: *** [tests/__depend__] Error 2
make[2]: Leaving directory `/opt/dimi/dev/wine/wine/dlls/advapi32'
make[1]: *** [advapi32/__depend__] Error 2
make[1]: Leaving directory `/opt/dimi/dev/wine/wine/dlls'
make: *** [dlls/__depend__] Error 2


More information about the wine-devel mailing list