dlls/ completion nit

Dimitrie O. Paun dpaun at rogers.com
Sun Sep 29 22:25:54 CDT 2002

On September 28, 2002 03:42 am, Dmitry Timoshkov wrote:
> 1. copy WineHQ CVS tree to ~/wine_hq_src
> 2. mkdir ~/wine; cd ~/wine
> 3. ../wine_hq_src/configure; make depend; make

Thanks! But this doesn't work quite right:

[dimi at dimi wine]$ mv wine wine.src
[dimi at dimi wine]$ mkdir wine.build
[dimi at dimi wine]$ cd wine.build
[dimi at dimi wine.build]$ ../wine.src/configure --silent
[dimi at dimi wine.build]$ make depend
cd `dirname dlls/__depend__` && make depend
make[1]: Entering directory `/home/dimi/dev/wine/wine.build/dlls'
cd `dirname advapi32/__depend__` && make depend
make[2]: Entering directory `/home/dimi/dev/wine/wine.build/dlls/advapi32'
cd `dirname tests/__depend__` && make depend
make[3]: Entering directory `/home/dimi/dev/wine/wine.build/dlls/advapi32/tests'
../../../tools/makedep -I../../../../wine.src/dlls/advapi32/tests -I. -I../../../../wine.src/include -I../../../include  -C../../../../wine.src/dlls/advapi32/tests registry.c
make[3]: ../../../tools/makedep: Command not found
make[3]: *** [depend] Error 127
make[3]: Leaving directory `/home/dimi/dev/wine/wine.build/dlls/advapi32/tests'
make[2]: *** [tests/__depend__] Error 2
make[2]: Leaving directory `/home/dimi/dev/wine/wine.build/dlls/advapi32'
make[1]: *** [advapi32/__depend__] Error 2
make[1]: Leaving directory `/home/dimi/dev/wine/wine.build/dlls'
make: *** [dlls/__depend__] Error 2

To fix this I had to do:

[dimi at dimi wine.build]$ cp ../wine.src/tools/makedep tools/

(I had makedep built already in the source tree)

This doesn't sound right, does it?


More information about the wine-devel mailing list