current cvs doesn't compile, winearts, undefined reference to `DSDEVID_DefaultPlayback'

hatky hatky at
Tue Jan 27 13:46:05 CST 2004

make[2]: Entering directory `/home/hatky/cvs/wine/dlls/winmm/winealsa'
make[2]: Nothing to be done for `all'.
make[2]: Leaving directory `/home/hatky/cvs/wine/dlls/winmm/winealsa'
make[2]: Entering directory `/home/hatky/cvs/wine/dlls/winmm/winearts'
gcc -shared 
winearts.drv.spec.o    arts.o audio.o  winearts.drv.dbg.o -o 
-L../../../dlls -L../../../libs/wine -lwine -L/usr/lib -ldl -lartsc -lpthread 
-luuid -L../../../libs/port -lwine_port  -lm  -lc
audio.o(.text+0x4112): In function `wodDsGuid':
/home/hatky/cvs/wine/dlls/winmm/winearts/audio.c:2058: undefined reference to 
collect2: ld returned 1 exit status
make[2]: *** [] Error 1
make[2]: Leaving directory `/home/hatky/cvs/wine/dlls/winmm/winearts'
make[1]: *** [winmm/winearts] Error 2
make[1]: Leaving directory `/home/hatky/cvs/wine/dlls'
make: *** [dlls] Error 2

Compilation failed, aborting install.

Mandrake Linux 9.2 box.......


Hebrew translator of
Helper of
Worshiper of

More information about the wine-devel mailing list