Error in make install

Andrew Neil Ramage nrsc16850 at
Sat Jun 4 21:20:22 CDT 2005

Since I do not know which part is relevant, I have placed as much of the 
output from a wine build at as 
was available on the terminal window.  Below are the last few lines.

/usr/bin/gcc -c -I. -I. -I../../include -I../../include  -D__WINESRC__
-D_ADVAPI32_ -D_REENTRANT -fPIC -Wall -pipe -mpreferred-stack-boundary=2
-fno-strict-aliasing -gstabs+ -Wpointer-arith  -g -O2 -o security.o
{standard input}: Assembler messages:
{standard input}:19402: Error: invalid character (0x8) in operand 2
make[2]: *** [security.o] Error 1
make[2]: Leaving directory
make[1]: *** [advapi32/__install-lib__] Error 2
make[1]: Leaving directory `/home/andrew/Download/Software/wine/dlls'
make: *** [dlls/__install-lib__] Error 2



You can be the captain
I will draw the chart
Sailing into destiny
Closer to the heart

Closer to the Heart by Rush (A Farewell to Kings, 1977)


More information about the wine-devel mailing list