Wine does not build [ wined3d ]

Ivan Gyurdiev ivg2 at
Wed Jun 8 19:54:51 CDT 2005

What about this?

basetexture.c:275: error: static declaration of
‘IWineD3DBaseTexture_Vtbl’ follows non-static declaration
wined3d_private.h:495: error: previous declaration of
‘IWineD3DBaseTexture_Vtbl’ was here
make[2]: *** [basetexture.o] Error 1
make[2]: Leaving directory `/home/phantom/src/wine/dlls/wined3d'
make[1]: *** [wined3d] Error 2
make[1]: Leaving directory `/home/phantom/src/wine/dlls'
make: *** [dlls] Error 2

Ivan Gyurdiev <ivg2 at>
Cornell University

More information about the wine-devel mailing list