make test failure (#7?)

Juan Lang juan_lang at
Fri Sep 29 13:05:19 CDT 2006

After I run make test a bunch of times to get other failures to disappear,
I get this:

make[2]: Entering directory `/home/juan/src/wine-20050725/dlls/user/tests'
../../../tools/runtest -q -P wine -M user32.dll -T ../../.. -p win.c && touch win.ok
fixme:win:WIN_CreateWindowEx Parent is HWND_MESSAGE
win.c:2554: Test failed: message 000f available
make[2]: *** [win.ok] Error 1
make[2]: Leaving directory `/home/juan/src/wine-20050725/dlls/user/tests'
make[1]: *** [user/tests/__test__] Error 2
make[1]: Leaving directory `/home/juan/src/wine-20050725/dlls'
make: *** [dlls/__test__] Error 2


Do You Yahoo!?
Tired of spam?  Yahoo! Mail has the best spam protection around 

More information about the wine-devel mailing list