Error while compiling the wine-0.9.49 in RedHat Linux

manish jaiswal manish.iitm at
Fri Nov 30 23:08:17 CST 2007

While compiling the wine-0.9.49 I am getting these error.
Please help me to resolve these error's.

winegcc: gcc failed
make[2]: *** [] Error 2
make[2]: Leaving directory `/home/manish/Desktop/Download/wine-0.9.49/dlls/winex11.drv'
make[1]: *** [winex11.drv] Error 2
make[1]: Leaving directory `/home/manish/Desktop/Download/wine-0.9.49/dlls'
make: *** [dlls] Error 2

Thanking in anticipation.

with regards:

      Chat on a cool, new interface. No download required. Go to
-------------- next part --------------
An HTML attachment was scrubbed...

More information about the wine-devel mailing list