[PATCH 1/2] ntdll: windows refuses to load an image; if sections overlap the header size as given in the SizeOfHeaders field

Dan Kegel dank at kegel.com
Tue Oct 11 11:06:21 CDT 2011

Hi Bernhard,
Build fails here:

loader.c: In function ‘test_section_mapping’:
loader.c:706:9: error: unused variable ‘i’ [-Werror=unused-variable]
cc1: all warnings being treated as errors
make[1]: *** [loader.o] Error 1
make[1]: Leaving directory
make: *** [dlls/kernel32/tests] Error 2


Can you fix and resubmit the series?

More information about the wine-devel mailing list