[PATCH 1/2] ntdll: windows refuses to load an image; if sections overlap the header size as given in the SizeOfHeaders field

Bernhard Loos bernhardloos at googlemail.com
Tue Oct 11 11:10:47 CDT 2011

On Tue, Oct 11, 2011 at 6:06 PM, Dan Kegel <dank at kegel.com> wrote:
> Hi Bernhard,
> Build fails here:
> loader.c: In function ‘test_section_mapping’:
> loader.c:706:9: error: unused variable ‘i’ [-Werror=unused-variable]
> cc1: all warnings being treated as errors
> make[1]: *** [loader.o] Error 1
> make[1]: Leaving directory
> `/home/bob/wineslave.dir/sandbox/slave/runtests-default/build/dlls/kernel32/tests'
> make: *** [dlls/kernel32/tests] Error 2
> http://buildbot.kegel.com:8010/builders/runtests-default/builds/159
> Can you fix and resubmit the series?

It gets used in patch 2/2, that's why I overlooked it. Should I still
resubmit it, as it would be only broken for a single revision?

More information about the wine-devel mailing list