80141: vbscript: Added Global_IsEmpty implementation

Dan Kegel dank at kegel.com
Wed Oct 19 12:11:13 CDT 2011

Hi Jacek,
build failed here... did you forget #include <assert.h> ?

On Wed, Oct 19, 2011 at 9:56 AM,  <buildbot at kegel.com> wrote:
> This is an experimental automated build and test service.
> Please feel free to ignore this email while we work the kinks out.
> For more info about this message, see http://wiki.winehq.org/BuildBot
> The Buildbot has detected a failed build on builder runtests-default while building Wine.
> Full details are available at: http://buildbot.kegel.com/builders/runtests-default/builds/715 (though maybe not for long, as I'm still reinstalling the buildbot periodically while experimenting)
> BUILD FAILED: failed shell_2
> Errors:
> global.c: In function 'Global_IsEmpty':
> global.c:281:5: error: implicit declaration of function 'assert' [-Werror=implicit-function-declaration]
> make[1]: *** [global.o] Error 1
> make: *** [dlls/vbscript] Error 2
> make: *** Waiting for unfinished jobs....

More information about the wine-devel mailing list