80245: riched20/tests: test format rect adaption to window size and behavior with zero-sized windows

Dan Kegel dank at kegel.com
Sat Oct 22 17:10:52 CDT 2011

Fails to build here...

On Oct 22, 2011 1:48 PM, <buildbot at kegel.com> wrote:

This is an experimental automated build and test service.
Please feel free to ignore this email while we work the kinks out.

For more info about this message, see http://wiki.winehq.org/BuildBot

The Buildbot has detected a failed build on builder runtests-default while
building Wine.
Full details are available at:
http://buildbot.kegel.com/builders/runtests-default/builds/898 (though maybe
not for long, as I'm still reinstalling the buildbot periodically while
BUILD FAILED: failed shell_2

editor.c: In function 'test_format_rect':
editor.c:6369:5: error: passing argument 4 of 'SendMessageA' makes integer
from pointer without a cast [-Werror]
make[1]: *** [editor.o] Error 1
make: *** [dlls/riched20/tests] Error 2
make: *** Waiting for unfinished jobs....

wine-tests-results mailing list
wine-tests-results at winehq.org
-------------- next part --------------
An HTML attachment was scrubbed...
URL: <http://www.winehq.org/pipermail/wine-devel/attachments/20111022/88cc7f31/attachment.html>

More information about the wine-devel mailing list