[PATCH v3 6/6] setupapi: Implement SetupAddInstallSectionToDiskSpaceList.

Marvin testbot at winehq.org
Sun Oct 20 16:30:38 CDT 2019


Hi,

While running your changed tests, I think I found new failures.
Being a bot and all I'm not very good at pattern recognition, so I might be
wrong, but could you please double-check?

Full results can be found at:
https://testbot.winehq.org/JobDetails.pl?Key=58092

Your paranoid android.


=== build (build log) ===

../../../../wine/dlls/setupapi/tests/diskspace.c:1120:5: error: expected ‘;’ before ‘test_SetupAddSectionToDiskSpaceListA’
Makefile:252: recipe for target 'diskspace.o' failed
Makefile:7763: recipe for target 'dlls/setupapi/tests' failed
Task: The exe32 Wine crossbuild failed

=== debian10 (build log) ===

../../../../wine/dlls/setupapi/tests/diskspace.c:1119:44: error: expected ‘;’ before ‘test_SetupAddSectionToDiskSpaceListA’
../../../wine/dlls/setupapi/diskspace.c:197:41: error: ‘diskspace’ undeclared (first use in this function); did you mean ‘diskSpace’?
../../../wine/dlls/setupapi/diskspace.c:253:50: error: ‘diskspace’ undeclared (first use in this function); did you mean ‘diskSpace’?
Task: The win32 build failed

=== debian10 (build log) ===

../../../../wine/dlls/setupapi/tests/diskspace.c:1119:44: error: expected ‘;’ before ‘test_SetupAddSectionToDiskSpaceListA’
../../../wine/dlls/setupapi/diskspace.c:197:41: error: ‘diskspace’ undeclared (first use in this function); did you mean ‘diskSpace’?
../../../wine/dlls/setupapi/diskspace.c:253:50: error: ‘diskspace’ undeclared (first use in this function); did you mean ‘diskSpace’?
Task: The wow64 build failed



More information about the wine-devel mailing list