ntdll compile error

Henrik "Morge" Johansson morge at strangeland.nu
Mon Aug 13 14:45:34 CDT 2001


When I try to make wine (tried older versions and latest CVS) everyting
works ok until it get's to dlls/ntdll (tried both manually and
tools/wineinstall) then I get this message:

make[1]: Entering directory `/stuff/wine/wine/dlls'
make[2]: Entering directory `/stuff/wine/wine/dlls/ntdll'
../../tools/winebuild/winebuild -fPIC -L../../dlls  -o ntdll.spec.c -spec
make[2]: *** [ntdll.spec.c] Segmentation fault (core dumped)
make[2]: Leaving directory `/stuff/wine/wine/dlls/ntdll'
make[1]: *** [ntdll/libntdll.so] Error 2
make[1]: Leaving directory `/stuff/wine/wine/dlls'
make: *** [dlls] Error 2

Compilation failed, aborting install.

Anybody else got this error and/or know a solution?

/Henrik J

More information about the wine-users mailing list