20020710 & winetest

Kari Hurtta hurtta+wine-users-1 at ozone.fmi.fi
Sun Jul 14 07:54:26 CDT 2002

Last 3 wines are failed to compile on various reasons.

(If I remember correctly: 20020411 compiles;
  20020509, 20020605, 20020710 does not.)

wine 20020710

make[2]: Entering directory `/home/hurtta/game/wine-20020710/programs/winetest'
gcc -c -I. -I. -I../../include -I../../include `perl -MExtUtils::Embed -e perl_inc` -g -O2 -Wall 
-fno-strength-reduce -mpreferred-stack-boundary=2 -fPIC -DSTRICT -DNONAMELESSUNION 
-DNONAMELESSSTRUCT `perl -MExtUtils::Embed -e ccflags` -D_REENTRANT -I/usr/X11R6/include -o 
winetest.o winetest.c
winetest.c:27: EXTERN.h: No such file or directory
winetest.c:28: perl.h: No such file or directory
make[2]: *** [winetest.o] Error 1
make[2]: Leaving directory `/home/hurtta/game/wine-20020710/programs/winetest'
make[1]: *** [winetest] Error 2
make[1]: Leaving directory `/home/hurtta/game/wine-20020710/programs'
make: *** [programs] Error 2

Is winetest requiring some extra which is not bundled with Wine?

(I think that 20020605 failed with same.)

Linux Mandrake release 7.2 (Odyssey) for i586

More information about the wine-users mailing list