wine-20040213 does not compile

Mark Hannessen msh104 at
Sat Feb 14 12:08:48 CST 2004

hi guys, I tried compiling wine-20040213 today but I got the following error:

make[2]: Entering directory `/progs/build/wine-20040213/dlls/x11drv'
gcc -c -I. -I. -I../../include -I../../include -I/usr/X11R6/include 
-D__WINESRC__ -DBINDIR="\"/usr/bin\"" -D_REENTRANT -fPIC -Wall -pipe 
-mpreferred-stack-boundary=2 -fno-strict-aliasing -gstabs+ -Wpointer-arith  
-g -O2 -o keyboard.o keyboard.c
keyboard.c: In function `X11DRV_ToUnicodeEx':
keyboard.c:2128: error: `XK_EuroSign' undeclared (first use in this function)
keyboard.c:2128: error: (Each undeclared identifier is reported only once
keyboard.c:2128: error: for each function it appears in.)
make[2]: *** [keyboard.o] Error 1
make[2]: Leaving directory `/progs/build/wine-20040213/dlls/x11drv'
make[1]: *** [x11drv] Error 2
make[1]: Leaving directory `/progs/build/wine-20040213/dlls'
make: *** [dlls] Error 2

anybody any hints?

Mark Hannessen

More information about the wine-users mailing list