wine-20040309 build error

Sebastien Fievet sebastien.fievet at
Mon Mar 29 14:33:01 CST 2004

Hi all,

I am trying to build wine-20040309, and i am facing a gcc crash while compiling
winetest. The log is below (sorry : it's localized in french).

make[2]: Entre dans le répertoire
-B../../tools/winebuild -mwindows gui.o main.o send.o util.o 
winetest.exe.dbg.o gui.res winetest.res -o -L../../dlls 
-lcomctl32 -luser32 -lwsock32 -L../../libs/wine -lwine  -L../../libs/port
-lwine_port -L/opt/mm/lib -L/opt/gnome/lib -lm gcc: Erreur internal error:
Processus arrété (programme cc1) SVP soumettre un rapport complet d'anomalies.
Consulter <URL:> pour les instructions.
winegcc: gcc failed.
make[2]: *** [] Erreur 2
make[2]: Quitte le répertoire
`/home/root/build/wine-20040309/programs/winetest'make[1]: *** [winetest]
Erreur 2 make[1]: Quitte le répertoire
`/home/root/build/wine-20040309/programs' make: *** [programs] Erreur 2

In case it may help, my config is : 
- k6-2 500,
- kernel-2.4.25,
- glibc-2.2.5,
- gcc-3.3.3.

I had no problem with the previous version of wine. I don't know what's going
on... Any little help would be great!

Regards, Sebastien.

More information about the wine-users mailing list