[Wine]Compile wine fails

Dirk Vornheder dirk.vornheder at piper-home.de
Thu May 26 16:26:06 CDT 2005

Hi !

Latest wine version from cvs fails after compile and installing alsa 1.0.9rc4:

make[2]: Leaving directory `/backup/privat/emulator/wine/dlls/vwin32.vxd'
rm -f vwin32.vxd.so && ln -s vwin32.vxd/vwin32.vxd.so vwin32.vxd.so
make[2]: Entering directory `/backup/privat/emulator/wine/dlls/winmm/winealsa'
gcc -c -I. -I. -I../../../include -I../../../include  -D__WINESRC__   
-D_REENTRANT -fPIC -Wall -pipe -mpreferred-stack-boundary=2 
-fno-strict-aliasing -gstabs+ -Wpointer-arith  -g -O2 -o audio.o audio.c
In file included from /usr/include/alsa/asoundlib.h:48,
                 from alsa.h:23,
                 from audio.c:63:
/usr/include/alsa/conf.h:183: error: syntax error before "struct"
make[2]: *** [audio.o] Error 1
make[2]: Leaving directory `/backup/privat/emulator/wine/dlls/winmm/winealsa'
make[1]: *** [winmm/winealsa] Error 2
make[1]: Leaving directory `/backup/privat/emulator/wine/dlls'
make: *** [dlls] Error 2


More information about the wine-users mailing list