[Wine] Compile cvs version fails

Dirk Vornheder dirk.vornheder at piper-home.de
Sun Oct 30 05:40:30 CST 2005

Hi !

Compile latest cvs version fails:

make[2]: Leaving directory `/backup/privat/emulator/wine/dlls/winedos'
rm -f winedos.dll.so && ln -s winedos/winedos.dll.so winedos.dll.so
rm -f wprocs.dll.so && ln -s winedos.dll.so wprocs.dll.so
make[2]: Entering directory `/backup/privat/emulator/wine/dlls/activeds'
gcc -c -I. -I. -I../../include -I../../include  -D__WINESRC__   -D_REENTRANT 
-fPIC -Wall -pipe -mpreferred-stack-boundary=2 -fno-strict-aliasing -gstabs+ 
-Wdeclaration-after-statement -Wpointer-arith  -g -O2  -o activeds_main.o 
../../tools/winegcc/winegcc -B../../tools/winebuild -shared ./activeds.spec    
activeds_main.o     -o activeds.dll.so -L../../dlls    -L../../libs/wine 
-lwine  -L../../libs/port -lwine_port
../../dlls/libwinecrt0.a(stub.o): In function 
/privat/emulator/wine/dlls/winecrt0/stub.c:32: undefined reference to 
collect2: ld gab 1 als Ende-Status zurück
winegcc: gcc failed.
make[2]: *** [activeds.dll.so] Fehler 2
make[2]: Leaving directory `/backup/privat/emulator/wine/dlls/activeds'
make[1]: *** [activeds] Fehler 2
make[1]: Leaving directory `/backup/privat/emulator/wine/dlls'
make: *** [dlls] Fehler 2


More information about the wine-users mailing list