[Wine] Build Error

David P. Donahue ddonahue at ccs.neu.edu
Sat Sep 17 12:10:07 CDT 2005

I just downloaded the Wine source (20050830) and I get the following 
error when running "make depend && make":

winldap_private.h:289: error: parse error before "BerElement"
winldap_private.h:290: error: parse error before "BerElement"
winldap_private.h:322: error: parse error before "BerElement"
winldap_private.h:323: error: parse error before "BerElement"
make[2]: *** [add.o] Error 1
make[2]: Leaving directory `/usr/src/wine-20050830/dlls/wldap32'
make[1]: *** [wldap32] Error 2
make[1]: Leaving directory `/usr/src/wine-20050830/dlls'
make: *** [dlls] Error 2

For reference, I'm running Slackware 10.0.  Any ideas?

David P. Donahue
ddonahue at ccs.neu.edu

More information about the wine-users mailing list