[Wine] Re: Call for help with Wine 1.0 testing

Timeout wineforum-user at winehq.org
Fri May 16 01:57:44 CDT 2008

Last Git is not compiling for me. I get the message:

/usr/lib64/gcc/x86_64-suse-linux/4.1.2/../../../../x86_64-suse-linux/bin/ld: cannot find -lXext
collect2: ld returned 1 exit status
winegcc: gcc failed
make[2]: *** [winex11.drv.so] Fehler 2
make[2]: Leaving directory `/home/yolande/wine-git/dlls/winex11.drv'
make[1]: *** [winex11.drv] Fehler 2
make[1]: Leaving directory `/home/yolande/wine-git/dlls'
make: *** [dlls] Fehler 2

although I used ./configure --x-libraries=/usr/x11R6/lib && make
to compile and all X-org libraries (32 and 64 bit) are there

Usually it does compile fine

More information about the wine-users mailing list