[Wine] Error while building wine 1.1.13 on Mac Os X

James Mckenzie jjmckenzie51 at earthlink.net
Mon Jan 26 12:49:11 CST 2009

mr jingle <wineforum-user at winehq.org>
>Sent: Jan 26, 2009 7:35 AM
>To: wine-users at winehq.org
>Subject: [Wine]  Error while building wine 1.1.13 on Mac Os X
>As in subject, when I try building wine 1.1.13 using Mac OS X 10.5.6 using both the latest developer tools and fink packages (for libjpeg, libpng, libxml2, etc) it gives an error on "make && make depend" with the following message:

make depend is run first, not second.
>rm -f libwine_port.a
>ar rc libwine_port.a ffs.o fstatvfs.o futimes.o getopt.o getopt1.o getpagesize.o gettid.o interlocked.o isinf.o isnan.o lstat.o memcpy_unaligned.o memmove.o mkstemps.o poll.o pread.o pwrite.o readlink.o spawn.o statvfs.o strcasecmp.o strerror.o strncasecmp.o symlink.o usleep.o    
>ar: temporary file: Permission denied
>make[2]: *** [libwine_port.a] Error 1
>make[1]: *** [port] Error 2
>make: *** [libs] Error 2
Is your hard drive full?  ar should be able to run given what you show here.

James McKenzie

More information about the wine-users mailing list