[Wine] Re: garena/wc3 "gdi32.dll" failed to initialize...

Drakuwa wineforum-user at winehq.org
Tue Jan 26 06:11:45 CST 2010

I think this might help in solving the problem. This is the exit status of the ./tools/wineinstall command:

make[1]: Entering directory `/home/Drakuwa/wine-git/server'
gcc -c -I. -I. -I../include -I../include  -D__WINESRC__  -Wall -pipe -fno-strict-aliasing -Wdeclaration-after-statement -Wstrict-prototypes -Wtype-limits -Wwrite-strings -Wpointer-arith  -g -O2  -o fd.o fd.c
fd.c: In function ‘req_register_async_l’:
fd.c:2340: error: ‘const struct fd_ops’ has no member named ‘queue_async_l’
make[1]: *** [fd.o] Error 1
make[1]: Leaving directory `/home/Drakuwa/wine-git/server'
make: *** [server] Error 2 
Compilation failed, aborting install.

What could I do to build wine and wineserver correctly?

More information about the wine-users mailing list