wine under cygwin

James Hawkins truiken at
Sun Nov 7 15:45:53 CST 2004

I'm trying to compile wine under cygwin, but I am getting this error:

Entering directory `/home/James Hawkins/wine/dlls/dsound/tests'
gcc capture.o ds3d.o ds3d8.o dsound.o dsound8.o propset.o testlist.o 
-o dsound_test.exe -ldsound -lole32 -luser32 -lkernel32 -ldxguid
-luuid -ldxerr8
multiple definition of `_DSPROPSETID_DirectSoundDevice'
Hawkins/wine/dlls/dsound/tests/propset.c:62: first defined here
multiple definition of `_CLSID_DirectSoundPrivate'
Hawkins/wine/dlls/dsound/tests/propset.c:61: first defined here
collect2: ld returned 1 exit status
make[3]: *** [dsound_test.exe] Error 1
make[3]: Leaving directory `/home/James Hawkins/wine/dlls/dsound/tests'
make[2]: *** [tests] Error 2
make[2]: Leaving directory `/home/James Hawkins/wine/dlls/dsound'
make[1]: *** [dsound] Error 2
make[1]: Leaving directory `/home/James Hawkins/wine/dlls'
make: *** [dlls] Error 2

Has anyone successfully compiled wine under cygwin, or does anyone
have an idea of what the problem is?

James Hawkins

More information about the wine-devel mailing list