problems regression testing/compiling wine

EA Durbin ead1234 at
Sun May 13 06:34:58 CDT 2007

I'm having problems regression testing between 0.9.15 and 0.9.37. On 3+ 
bisects I keep getting the following error and wine won't compile.

/home/eric/wine/dlls/winex11.drv/palette.c:866: undefined reference to 
palette.o:/home/eric/wine/dlls/winex11.drv/palette.c:881: more undefined 
references to `GDI_ReleaseObj' follow
palette.o: In function `X11DRV_RealizePalette':
/home/eric/wine/dlls/winex11.drv/palette.c:1251: undefined reference to 
/home/eric/wine/dlls/winex11.drv/palette.c:1253: undefined reference to 
collect2: ld returned 1 exit status
winegcc: gcc failed.
make[2]: *** [] Error 2
make[2]: Leaving directory `/home/eric/wine/dlls/winex11.drv'
make[1]: *** [winex11.drv] Error 2
make[1]: Leaving directory `/home/eric/wine/dlls'
make: *** [dlls] Error 2

More photos, more messages, more storage—get 2GB with Windows Live Hotmail.

More information about the wine-devel mailing list