[Wine]Compilation fails

Hossein Movahhedian dma8hm1956 at gmail.com
Sat Apr 2 03:01:26 CST 2005

   Dear All
   I am using ./tools/wineinstall to compile and install
 Wine-20050310 with all default settings unchanged except
 `prefix' in ./tools/wineinstall. which I have changed to
 But wineinstall exits with the following error message:{{{

make[2]: Entering directory `/ext3/pkgs2/ztmp/Downloads/Wine-20050310/wine-20050310/programs/winetest'
../../tools/winegcc/winegcc -B../../tools/winebuild -mconsole gui.o main.o send.o util.o  winetest.exe.dbg.o winetest.res -o winetest.exe.so -L../../dlls  -lcomctl32 -luser32 -lgdi32 -lwsock32 -L../../libs/wine -lwine  -L../../libs/port -lwine_port
winetest.exe-XI01Hj.spec.c:173582:63: warning: no newline at end of file
winetest.exe-XI01Hj.spec.c:173582: parse error at end of input
winegcc: gcc failed.
make[2]: *** [winetest.exe.so] Error 2
make[2]: Leaving directory `/ext3/pkgs2/ztmp/Downloads/Wine-20050310/wine-20050310/programs/winetest'
make[1]: *** [winetest] Error 2
make[1]: Leaving directory `/ext3/pkgs2/ztmp/Downloads/Wine-20050310/wine-20050310/programs'
make: *** [programs] Error 2

Compilation failed, aborting install.

   Any help would be gratefully appreciated.


More information about the wine-users mailing list